{"text_format":"1","workbook":"xlsx","n_sheets":4,"sheets":["Instructions","Customer Information","Payment Schedule","Disclosure"],"not_rendered":{"charts":1,"images":6,"macros":1,"external_links":0,"defined_names":0,"comments":0,"pivot_tables":0},"unopened":[],"bounds":{"document_bytes":16777216,"sheet_cells":100000,"rows_first":2000,"rows_last":500,"rows_between":2000,"halvings":0,"cell_chars":16384,"cell_head_chars":4096},"cells_cut":0,"cells_raw":0,"read":"whole","date_system":"1900"}

{"sheet":"Instructions","index":0,"n_rows":17,"n_cols":3,"rows_kept":17,"cut":false,"hidden":false,"merged":[[5,1,5,11],[3,1,3,5]]}
["Expert Financial Services, Inc."]
["Residential Mortgage Kit"]
[]
[null,"Use this application to prepare a residential mortgage proposal for a potential borrower. Use the menu below to open the data entry form to enter and edit information about the borrower, the property, and the proposed loan."]
[]
[null,"Use the menu buttons below to complete a loan proposal. From this menu you can\nenter and edit the required information display the payment schedule, and display the Truth-in-Lending disclosure. "]
[]
[]
[null,null,"1. Enter Borrower, Property, and Loan Information"]
[]
[]
[]
[null,null,"2. Create and/or View the Loan Repayment Schedule"]
[]
[]
[]
[null,null,"3. Create and/or View the Truth-in-Lending Disclosure"]

{"sheet":"Customer Information","index":1,"n_rows":17,"n_cols":6,"rows_kept":17,"cut":false,"hidden":false,"merged":[]}
["Expert Financial Services, Inc."]
["Residential Mortgage Kit"]
[]
["Borrower Name:",null,null,null,"Investment Account?"]
["Borrower SSN:"]
[null,null,null,null,"Loan Principal:",150000]
["Current Address:"]
["City:",null,null,null,"Loan Rate:",5.7500000000000002E-2]
["State:"]
["Zip Code:",null,null,null,"Loan Term:",30]
["Home Telephone:"]
[]
["Property Address:"]
["City:"]
["State:"]
["Zip Code:"]
["Property Type:","Condo/Townhome"]

{"sheet":"Payment Schedule","index":2,"n_rows":369,"n_cols":7,"rows_kept":369,"cut":false,"hidden":false,"merged":[[3,5,3,6]]}
["Expert Financial Services, Inc."]
["Residential Mortgage Kit"]
[]
["Principal:",{"$f":"'Customer Information'!$F$6","v":150000},null,null,null,"Closing Costs"]
["Rate:",{"$f":"'Customer Information'!$F$8","v":5.7500000000000002E-2},null,null,null,"Origination Fee:",{"$f":"B4*0.02","v":3000}]
["Term:",{"$f":"'Customer Information'!$F$10","v":30},null,null,null,"Points:",{"$f":"IF('Customer Information'!F4=FALSE,B4*(B6*0.001),(B4*(B6*0.001)-(B4*0.01)))","v":4500}]
["Payment:",{"$f":"PMT(B5/12,B6*12,-B4)","v":875.35928466532948},null,null,null,"Total  Fees:",{"$f":"SUM(G5:G6)","v":7500}]
[]
["Payment\nNumber","Principal","Interest","Cumulative\nPrincipal","Cumulative\nInterest","Total Paid","Balance"]
[1,156.61000000000001,718.75,156.61000000000001,718.75,875.36,149843.39000000001]
[2,157.36000000000001,718,313.97000000000003,1436.75,1750.72,149686.03]
[3,158.11000000000001,717.25,472.08,2154,2626.08,149527.92000000001]
[4,158.87,716.49,630.95000000000005,2870.49,3501.44,149369.04999999999]
[5,159.63,715.73,790.58,3586.22,4376.8,149209.42000000001]
[6,160.4,714.96,950.98,4301.18,5252.16,149049.01999999999]
[7,161.16999999999999,714.19,1112.1500000000001,5015.37,6127.52,148887.85]
[8,161.94,713.42,1274.0899999999999,5728.79,7002.88,148725.91]
[9,162.71,712.65,1436.8,6441.44,7878.24,148563.20000000001]
[10,163.49,711.87,1600.29,7153.31,8753.6,148399.71]
[11,164.28,711.08,1764.57,7864.39,9628.9599999999991,148235.43]
[12,165.06,710.29,1929.63,8574.68,10504.31,148070.37]
[13,165.86,709.5,2095.4899999999998,9284.18,11379.67,147904.51]
[14,166.65,708.71,2262.14,9992.89,12255.03,147737.85999999999]
[15,167.45,707.91,2429.59,10700.8,13130.39,147570.41]
[16,168.25,707.11,2597.84,11407.91,14005.75,147402.16]
[17,169.06,706.3,2766.9,12114.21,14881.11,147233.1]
[18,169.87,705.49,2936.77,12819.7,15756.47,147063.23000000001]
[19,170.68,704.68,3107.45,13524.38,16631.830000000002,146892.54999999999]
[20,171.5,703.86,3278.95,14228.24,17507.189999999999,146721.04999999999]
[21,172.32,703.04,3451.27,14931.28,18382.55,146548.73000000001]
[22,173.15,702.21,3624.42,15633.49,19257.91,146375.57999999999]
[23,173.98,701.38,3798.4,16334.87,20133.27,146201.60000000001]
[24,174.81,700.55,3973.21,17035.419999999998,21008.63,146026.79]
[25,175.65,699.71,4148.8599999999997,17735.13,21883.99,145851.14000000001]
[26,176.49,698.87,4325.3500000000004,18434,22759.35,145674.65]
[27,177.33,698.02,4502.68,19132.02,23634.7,145497.32]
[28,178.18,697.17,4680.8599999999997,19829.189999999999,24510.05,145319.14000000001]
[29,179.04,696.32,4859.8999999999996,20525.509999999998,25385.41,145140.1]
[30,179.9,695.46,5039.8,21220.97,26260.77,144960.20000000001]
[31,180.76,694.6,5220.5600000000004,21915.57,27136.13,144779.44]
[32,181.62,693.73,5402.18,22609.3,28011.48,144597.82]
[33,182.49,692.86,5584.67,23302.16,28886.83,144415.32999999999]
[34,183.37,691.99,5768.04,23994.15,29762.19,144231.96]
[35,184.25,691.11,5952.29,24685.26,30637.55,144047.71]
[36,185.13,690.23,6137.42,25375.49,31512.91,143862.57999999999]
[37,186.02,689.34,6323.44,26064.83,32388.27,143676.56]
[38,186.91,688.45,6510.35,26753.279999999999,33263.629999999997,143489.65]
[39,187.8,687.55,6698.15,27440.83,34138.980000000003,143301.85]
[40,188.7,686.65,6886.85,28127.48,35014.33,143113.15]
[41,189.61,685.75,7076.46,28813.23,35889.69,142923.54]
[42,190.52,684.84,7266.98,29498.07,36765.050000000003,142733.01999999999]
[43,191.43,683.93,7458.41,30182,37640.410000000003,142541.59]
[44,192.35,683.01,7650.76,30865.01,38515.769999999997,142349.24]
[45,193.27,682.09,7844.03,31547.1,39391.129999999997,142155.97]
[46,194.2,681.16,8038.23,32228.26,40266.49,141961.76999999999]
[47,195.13,680.23,8233.36,32908.49,41141.85,141766.64000000001]
[48,196.06,679.3,8429.42,33587.79,42017.21,141570.57999999999]
[49,197,678.36,8626.42,34266.15,42892.57,141373.57999999999]
[50,197.94,677.42,8824.36,34943.57,43767.93,141175.64000000001]
[51,198.89,676.47,9023.25,35620.04,44643.29,140976.75]
[52,199.85,675.51,9223.1,36295.550000000003,45518.65,140776.9]
[53,200.8,674.56,9423.9,36970.11,46394.01,140576.1]
[54,201.77,673.59,9625.67,37643.699999999997,47269.37,140374.32999999999]
[55,202.73,672.63,9828.4,38316.33,48144.73,140171.6]
[56,203.7,671.66,10032.1,38987.99,49020.09,139967.9]
[57,204.68,670.68,10236.780000000001,39658.67,49895.45,139763.22]
[58,205.66,669.7,10442.44,40328.370000000003,50770.81,139557.56]
[59,206.65,668.71,10649.09,40997.08,51646.17,139350.91]
[60,207.64,667.72,10856.73,41664.800000000003,52521.53,139143.26999999999]
[61,208.63,666.73,11065.36,42331.53,53396.89,138934.64000000001]
[62,209.63,665.73,11274.99,42997.26,54272.25,138725.01]
[63,210.64,664.72,11485.63,43661.98,55147.61,138514.37]
[64,211.64,663.71,11697.27,44325.69,56022.96,138302.73000000001]
[65,212.66,662.7,11909.93,44988.39,56898.32,138090.07]
[66,213.68,661.68,12123.61,45650.07,57773.68,137876.39000000001]
[67,214.7,660.66,12338.31,46310.73,58649.04,137661.69]
[68,215.73,659.63,12554.04,46970.36,59524.4,137445.96]
[69,216.76,658.6,12770.8,47628.959999999999,60399.76,137229.20000000001]
[70,217.8,657.56,12988.6,48286.52,61275.12,137011.4]
[71,218.85,656.51,13207.45,48943.03,62150.48,136792.54999999999]
[72,219.89,655.46,13427.34,49598.49,63025.83,136572.66]
[73,220.95,654.41,13648.29,50252.9,63901.19,136351.71]
[74,222.01,653.35,13870.3,50906.25,64776.55,136129.70000000001]
[75,223.07,652.29,14093.37,51558.54,65651.91,135906.63]
[76,224.14,651.22,14317.51,52209.760000000002,66527.27,135682.49]
[77,225.21,650.15,14542.72,52859.91,67402.63,135457.28]
[78,226.29,649.07000000000005,14769.01,53508.98,68277.990000000005,135230.99]
[79,227.38,647.98,14996.39,54156.959999999999,69153.350000000006,135003.60999999999]
[80,228.47,646.89,15224.86,54803.85,70028.710000000006,134775.14000000001]
[81,229.56,645.79999999999995,15454.42,55449.65,70904.070000000007,134545.57999999999]
[82,230.66,644.70000000000005,15685.08,56094.35,71779.429999999993,134314.92000000001]
[83,231.77,643.59,15916.85,56737.94,72654.789999999994,134083.15]
[84,232.88,642.48,16149.73,57380.42,73530.149999999994,133850.26999999999]
[85,233.99,641.37,16383.72,58021.79,74405.509999999995,133616.28]
[86,235.11,640.24,16618.830000000002,58662.03,75280.86,133381.17000000001]
[87,236.24,639.12,16855.07,59301.15,76156.22,133144.93]
[88,237.37,637.99,17092.439999999999,59939.14,77031.58,132907.56]
[89,238.51,636.85,17330.95,60575.99,77906.94,132669.04999999999]
[90,239.65,635.71,17570.599999999999,61211.7,78782.3,132429.4]
[91,240.8,634.55999999999995,17811.400000000001,61846.26,79657.66,132188.6]
[92,241.96,633.4,18053.36,62479.66,80533.02,131946.64000000001]
[93,243.12,632.24,18296.48,63111.9,81408.38,131703.51999999999]
[94,244.28,631.08000000000004,18540.759999999998,63742.98,82283.740000000005,131459.24]
[95,245.45,629.91,18786.21,64372.89,83159.100000000006,131213.79]
[96,246.63,628.73,19032.84,65001.62,84034.46,130967.16]
[97,247.81,627.54999999999995,19280.650000000001,65629.17,84909.82,130719.35]
[98,249,626.36,19529.650000000001,66255.53,85785.18,130470.35]
[99,250.19,625.16999999999996,19779.84,66880.7,86660.54,130220.16]
[100,251.39,623.97,20031.23,67504.67,87535.9,129968.77]
[101,252.59,622.77,20283.82,68127.44,88411.26,129716.18]
[102,253.8,621.55999999999995,20537.62,68749,89286.62,129462.38]
[103,255.02,620.34,20792.64,69369.34,90161.98,129207.36]
[104,256.24,619.12,21048.880000000001,69988.460000000006,91037.34,128951.12]
[105,257.47000000000003,617.89,21306.35,70606.350000000006,91912.7,128693.65]
[106,258.7,616.66,21565.05,71223.009999999995,92788.06,128434.95]
[107,259.94,615.41999999999996,21824.99,71838.429999999993,93663.42,128175.01]
[108,261.19,614.16999999999996,22086.18,72452.600000000006,94538.78,127913.82]
[109,262.44,612.91999999999996,22348.62,73065.52,95414.14,127651.38]
[110,263.7,611.66,22612.32,73677.179999999993,96289.5,127387.68]
[111,264.95999999999998,610.4,22877.279999999999,74287.58,97164.86,127122.72]
[112,266.23,609.13,23143.51,74896.710000000006,98040.22,126856.49]
[113,267.51,607.85,23411.02,75504.56,98915.58,126588.98]
[114,268.79000000000002,606.57000000000005,23679.81,76111.13,99790.94,126320.19]
[115,270.07,605.28,23949.88,76716.41,100666.29,126050.12]
[116,271.37,603.99,24221.25,77320.399999999994,101541.65,125778.75]
[117,272.67,602.69000000000005,24493.919999999998,77923.09,102417.01,125506.08]
[118,273.98,601.38,24767.9,78524.47,103292.37,125232.1]
[119,275.29000000000002,600.07000000000005,25043.19,79124.539999999994,104167.73,124956.81]
[120,276.61,598.75,25319.8,79723.289999999994,105043.09,124680.2]
[121,277.93,597.42999999999995,25597.73,80320.72,105918.45,124402.27]
[122,279.27,596.09,25877,80916.81,106793.81,124123]
[123,280.60000000000002,594.76,26157.599999999999,81511.570000000007,107669.17,123842.4]
[124,281.95,593.41,26439.55,82104.98,108544.53,123560.45]
[125,283.3,592.05999999999995,26722.85,82697.039999999994,109419.89,123277.15]
[126,284.66000000000003,590.70000000000005,27007.51,83287.740000000005,110295.25,122992.49]
[127,286.02,589.34,27293.53,83877.08,111170.61,122706.47]
[128,287.39,587.97,27580.92,84465.05,112045.97,122419.08]
[129,288.77,586.59,27869.69,85051.64,112921.33,122130.31]
[130,290.14999999999998,585.21,28159.84,85636.85,113796.69,121840.16]
[131,291.54000000000002,583.82000000000005,28451.38,86220.67,114672.05,121548.62]
[132,292.94,582.41999999999996,28744.32,86803.09,115547.41,121255.67999999999]
[133,294.33999999999997,581.02,29038.66,87384.11,116422.77,120961.34]
[134,295.75,579.61,29334.41,87963.72,117298.13,120665.59]
[135,297.17,578.19000000000005,29631.58,88541.91,118173.49,120368.42]
[136,298.58999999999997,576.77,29930.17,89118.68,119048.85,120069.83]
[137,300.02,575.33000000000004,30230.19,89694.01,119924.2,119769.81]
[138,301.45999999999998,573.9,30531.65,90267.91,120799.56,119468.35]
[139,302.91000000000003,572.45000000000005,30834.560000000001,90840.36,121674.92,119165.44]
[140,304.36,571,31138.92,91411.36,122550.28,118861.08]
[141,305.82,569.54,31444.74,91980.9,123425.64,118555.26]
[142,307.27999999999997,568.08000000000004,31752.02,92548.98,124301,118247.98]
[143,308.75,566.61,32060.77,93115.59,125176.36,117939.23]
[144,310.23,565.13,32371,93680.72,126051.72,117629]
[145,311.72000000000003,563.64,32682.720000000001,94244.36,126927.08,117317.28]
[146,313.20999999999998,562.15,32995.93,94806.51,127802.44,117004.07]
[147,314.70999999999998,560.64,33310.639999999999,95367.15,128677.79,116689.36]
[148,316.22000000000003,559.14,33626.86,95926.29,129553.15,116373.14]
[149,317.74,557.62,33944.6,96483.91,130428.51,116055.4]
[150,319.26,556.1,34263.86,97040.01,131303.87,115736.14]
[151,320.79000000000002,554.57000000000005,34584.65,97594.58,132179.23000000001,115415.35]
[152,322.33,553.03,34906.980000000003,98147.61,133054.59,115093.02]
[153,323.87,551.49,35230.85,98699.1,133929.95000000001,114769.15]
[154,325.42,549.94000000000005,35556.269999999997,99249.04,134805.31,114443.73]
[155,326.98,548.38,35883.25,99797.42,135680.67000000001,114116.75]
[156,328.55,546.80999999999995,36211.800000000003,100344.23,136556.03,113788.2]
[157,330.12,545.24,36541.919999999998,100889.47,137431.39000000001,113458.08]
[158,331.71,543.65,36873.629999999997,101433.12,138306.75,113126.37]
[159,333.3,542.05999999999995,37206.93,101975.18,139182.10999999999,112793.07]
[160,334.89,540.47,37541.82,102515.65,140057.47,112458.18]
[161,336.5,538.86,37878.32,103054.51,140932.82999999999,112121.68]
[162,338.11,537.25,38216.43,103591.76,141808.19,111783.57]
[163,339.73,535.63,38556.160000000003,104127.39,142683.54999999999,111443.84]
[164,341.36,534,38897.519999999997,104661.39,143558.91,111102.48]
[165,342.99,532.37,39240.51,105193.76,144434.26999999999,110759.49]
[166,344.64,530.72,39585.15,105724.48,145309.63,110414.85]
[167,346.29,529.07000000000005,39931.440000000002,106253.55,146184.99,110068.56]
[168,347.95,527.41,40279.39,106780.96,147060.35,109720.61]
[169,349.61,525.74,40629,107306.7,147935.70000000001,109371]
[170,351.29,524.07000000000005,40980.29,107830.77,148811.06,109019.71]
[171,352.97,522.39,41333.26,108353.16,149686.42000000001,108666.74]
[172,354.66,520.69000000000005,41687.919999999998,108873.85,150561.76999999999,108312.08]
[173,356.36,519,42044.28,109392.85,151437.13,107955.72]
[174,358.07,517.29,42402.35,109910.14,152312.49,107597.65]
[175,359.79,515.57000000000005,42762.14,110425.71,153187.85,107237.86]
[176,361.51,513.85,43123.65,110939.56,154063.21,106876.35]
[177,363.24,512.12,43486.89,111451.68,154938.57,106513.11]
[178,364.98,510.38,43851.87,111962.06,155813.93,106148.13]
[179,366.73,508.63,44218.6,112470.69,156689.29,105781.4]
[180,368.49,506.87,44587.09,112977.56,157564.65,105412.91]
[181,370.26,505.1,44957.35,113482.66,158440.01,105042.65]
[182,372.03,503.33,45329.38,113985.99,159315.37,104670.62]
[183,373.81,501.55,45703.19,114487.54,160190.73000000001,104296.81]
[184,375.6,499.76,46078.79,114987.3,161066.09,103921.21]
[185,377.4,497.96,46456.19,115485.26,161941.45000000001,103543.81]
[186,379.21,496.15,46835.4,115981.41,162816.81,103164.6]
[187,381.03,494.33,47216.43,116475.74,163692.17000000001,102783.57]
[188,382.85,492.5,47599.28,116968.24,164567.51999999999,102400.72]
[189,384.69,490.67,47983.97,117458.91,165442.88,102016.03]
[190,386.53,488.83,48370.5,117947.74,166318.24,101629.5]
[191,388.38,486.97,48758.879999999997,118434.71,167193.59,101241.12]
{"$rows_left_out":170}
{"sheet":"Disclosure","index":3,"n_rows":16,"n_cols":4,"rows_kept":16,"cut":false,"hidden":false,"merged":[[13,2,13,3],[12,0,12,3],[14,0,15,0],[14,1,15,1]]}
["Expert Financial Services, Inc."]
["Residential Mortgage Kit"]
[]
["Date:",{"$f":"NOW()","v":"2011-03-05T19:37:32.150"}]
["Creditor:","Expert Financial Services, Inc."]
["Borrower:",{"$f":"'Customer Information'!$B$4","v":0}]
["Property Location:",{"$f":"'Customer Information'!$B$13","v":0}]
[]
[]
["Annual Percentage Rate\nThe cost of your credit as a yearly Rate","Finance Charge\nThe dollar amount the credit will cost you","Amount Financed\nThe amount of credit provided to you on your behalf","Total of Payments\nThe amount you will have paid after you have made all scheduled payments"]
[{"$f":"'Customer Information'!$F$8","v":5.7500000000000002E-2},{"$f":"-CUMIPMT(A11/12,A15,C11,1,A15,0)","v":165129.34247951859},{"$f":"'Customer Information'!F6","v":150000},{"$f":"B11+C11","v":315129.34247951861}]
[]
["Payment Schedule"]
["Number of Payments","Amount of Payments","When Payments are Due"]
[{"$f":"'Customer Information'!F10*12","v":360},{"$f":"PMT('Customer Information'!F8/12,'Customer Information'!F10*12,-'Customer Information'!F6)","v":875.35928466532948},"First:",{"$f":"B4+15","v":"2011-03-20T19:37:32.150"}]
[null,null,"Last:",{"$f":"DATE(YEAR(D15),MONTH(D15)+A15,DAY(D15))","v":"2041-03-20"}]